{"text_format":"1","workbook":"xlsx","n_sheets":14,"sheets":["Enero","Febrero","Marzo","Abril","Mayo","Junio","Julio","Agosto","Setiembre","Octubre","Noviembre","Diciembre","Informe","Configuración"],"not_rendered":{"charts":0,"images":0,"macros":1,"external_links":0,"defined_names":0,"comments":0,"pivot_tables":0},"unopened":[],"bounds":{"document_bytes":16777216,"sheet_cells":100000,"rows_first":2000,"rows_last":500,"rows_between":2000,"halvings":0,"cell_chars":16384,"cell_head_chars":4096},"cells_cut":0,"cells_raw":0,"read":"whole","date_system":"1900"}

{"sheet":"Enero","index":0,"n_rows":54,"n_cols":12,"rows_kept":54,"cut":false,"hidden":false,"merged":[]}
[null,"INFORME RNPQ MES","ENERO",{"$f":"Configuración!E2","v":2018},"SECCION",{"$f":"Configuración!G2","v":"TOXICO"}]
[]
[null,null,"STOCK","INGRESO 1","INGRESO 1","INGRESO 1","INGRESO 2","INGRESO 2","INGRESO 2","MERMA",null,"STOCK"]
["N°","SUSTANCIA CONTROLADA","ACTUAL","FECHA","CANTIDAD","REMITO","FECHA","CANTIDAD","REMITO","MENSUAL","OBSERVACIONES","ANTERIOR"]
[1,{"$f":"INDEX(Configuración!$A$3:'Configuración'!$B$52,A5,2)","v":"Acetato Etílico (en litros)"},{"$f":"$L5+$E5+$H5-$J5","v":0},null,null,null,null,null,null,null,null,{"$f":"Configuración!$C3","v":0}]
[2,{"$f":"INDEX(Configuración!$A$3:'Configuración'!$B$52,A6,2)","v":"Acetona (en litros)"},{"$f":"$L6+$E6+$H6-$J6","v":0},null,null,null,null,null,null,null,null,{"$f":"Configuración!$C4","v":0}]
[3,{"$f":"INDEX(Configuración!$A$3:'Configuración'!$B$52,A7,2)","v":"Acido Acético (en litros)"},0,null,null,null,null,null,null,null,null,{"$f":"Configuración!$C5","v":0}]
[4,{"$f":"INDEX(Configuración!$A$3:'Configuración'!$B$52,A8,2)","v":"Acido Clorhídrico (en litros)"},0,null,null,null,null,null,null,null,null,{"$f":"Configuración!$C6","v":0}]
[5,{"$f":"INDEX(Configuración!$A$3:'Configuración'!$B$52,A9,2)","v":"Acido Fórmico, sales y sus derivados (en litros)"},0,null,null,null,null,null,null,null,null,{"$f":"Configuración!$C7","v":0}]
[6,{"$f":"INDEX(Configuración!$A$3:'Configuración'!$B$52,A10,2)","v":"Acido Sulfúrico (en litros)"},0,null,null,null,null,null,null,null,null,{"$f":"Configuración!$C8","v":0}]
{"$rows_left_out":45}
{"sheet":"Febrero","index":1,"n_rows":54,"n_cols":12,"rows_kept":54,"cut":false,"hidden":false,"merged":[]}
[null,"INFORME RENPRE MES","FEBRERO",{"$f":"Configuración!E2","v":2018},"SECCION",{"$f":"Configuración!G2","v":"TOXICO"}]
[]
[null,null,"STOCK","INGRESO 1","INGRESO 1","INGRESO 1","INGRESO 2","INGRESO 2","INGRESO 2","MERMA",null,"STOCK"]
["N°","SUSTANCIA CONTROLADA","ACTUAL","FECHA","CANTIDAD","REMITO","FECHA","CANTIDAD","REMITO","MENSUAL","OBSERVACIONES","ANTERIOR"]
[1,{"$f":"INDEX(Configuración!$A$3:'Configuración'!$B$52,A5,2)","v":"Acetato Etílico (en litros)"},{"$f":"$L5+$E5+$H5-$J5","v":0},null,null,null,null,null,null,null,null,{"$f":"Enero!C5","v":0}]
[2,{"$f":"INDEX(Configuración!$A$3:'Configuración'!$B$52,A6,2)","v":"Acetona (en litros)"},{"$f":"$L6+$E6+$H6-$J6","v":0},null,null,null,null,null,null,null,null,{"$f":"Enero!C6","v":0}]
[3,{"$f":"INDEX(Configuración!$A$3:'Configuración'!$B$52,A7,2)","v":"Acido Acético (en litros)"},0,null,null,null,null,null,null,null,null,{"$f":"Enero!C7","v":0}]
[4,{"$f":"INDEX(Configuración!$A$3:'Configuración'!$B$52,A8,2)","v":"Acido Clorhídrico (en litros)"},0,null,null,null,null,null,null,null,null,{"$f":"Enero!C8","v":0}]
[5,{"$f":"INDEX(Configuración!$A$3:'Configuración'!$B$52,A9,2)","v":"Acido Fórmico, sales y sus derivados (en litros)"},0,null,null,null,null,null,null,null,null,{"$f":"Enero!C9","v":0}]
[6,{"$f":"INDEX(Configuración!$A$3:'Configuración'!$B$52,A10,2)","v":"Acido Sulfúrico (en litros)"},0,null,null,null,null,null,null,null,null,{"$f":"Enero!C10","v":0}]
{"$rows_left_out":45}
{"sheet":"Marzo","index":2,"n_rows":54,"n_cols":12,"rows_kept":54,"cut":false,"hidden":false,"merged":[]}
[null,"INFORME RNPQ MES","MARZO",{"$f":"Configuración!E2","v":2018},"SECCION",{"$f":"Configuración!G2","v":"TOXICO"}]
[]
[null,null,"STOCK","INGRESO 1","INGRESO 1","INGRESO 1","INGRESO 2","INGRESO 2","INGRESO 2","MERMA",null,"STOCK"]
["N°","SUSTANCIA CONTROLADA","ACTUAL","FECHA","CANTIDAD","REMITO","FECHA","CANTIDAD","REMITO","MENSUAL","OBSERVACIONES","ANTERIOR"]
[1,{"$f":"INDEX(Configuración!$A$3:'Configuración'!$B$52,A5,2)","v":"Acetato Etílico (en litros)"},{"$f":"$L5+$E5+$H5-$J5","v":0},null,null,null,null,null,null,null,null,{"$f":"Febrero!C5","v":0}]
[2,{"$f":"INDEX(Configuración!$A$3:'Configuración'!$B$52,A6,2)","v":"Acetona (en litros)"},{"$f":"$L6+$E6+$H6-$J6","v":0},null,null,null,null,null,null,null,null,{"$f":"Febrero!C6","v":0}]
[3,{"$f":"INDEX(Configuración!$A$3:'Configuración'!$B$52,A7,2)","v":"Acido Acético (en litros)"},0,null,null,null,null,null,null,null,null,{"$f":"Febrero!C7","v":0}]
[4,{"$f":"INDEX(Configuración!$A$3:'Configuración'!$B$52,A8,2)","v":"Acido Clorhídrico (en litros)"},0,null,null,null,null,null,null,null,null,{"$f":"Febrero!C8","v":0}]
[5,{"$f":"INDEX(Configuración!$A$3:'Configuración'!$B$52,A9,2)","v":"Acido Fórmico, sales y sus derivados (en litros)"},0,null,null,null,null,null,null,null,null,{"$f":"Febrero!C9","v":0}]
[6,{"$f":"INDEX(Configuración!$A$3:'Configuración'!$B$52,A10,2)","v":"Acido Sulfúrico (en litros)"},0,null,null,null,null,null,null,null,null,{"$f":"Febrero!C10","v":0}]
{"$rows_left_out":45}
{"sheet":"Abril","index":3,"n_rows":54,"n_cols":12,"rows_kept":54,"cut":false,"hidden":false,"merged":[]}
[null,"INFORME RENPRE MES","ABRIL",{"$f":"Configuración!E2","v":2018},"SECCION",{"$f":"Configuración!G2","v":"TOXICO"}]
[]
[null,null,"STOCK","INGRESO 1","INGRESO 1","INGRESO 1","INGRESO 2","INGRESO 2","INGRESO 2","MERMA",null,"STOCK"]
["N°","SUSTANCIA CONTROLADA","ACTUAL","FECHA","CANTIDAD","REMITO","FECHA","CANTIDAD","REMITO","MENSUAL","OBSERVACIONES","ANTERIOR"]
[1,{"$f":"INDEX(Configuración!$A$3:'Configuración'!$B$52,A5,2)","v":"Acetato Etílico (en litros)"},{"$f":"$L5+$E5+$H5-$J5","v":0},null,null,null,null,null,null,null,null,{"$f":"Marzo!C5","v":0}]
[2,{"$f":"INDEX(Configuración!$A$3:'Configuración'!$B$52,A6,2)","v":"Acetona (en litros)"},{"$f":"$L6+$E6+$H6-$J6","v":0},null,null,null,null,null,null,null,null,{"$f":"Marzo!C6","v":0}]
[3,{"$f":"INDEX(Configuración!$A$3:'Configuración'!$B$52,A7,2)","v":"Acido Acético (en litros)"},0,null,null,null,null,null,null,null,null,{"$f":"Marzo!C7","v":0}]
[4,{"$f":"INDEX(Configuración!$A$3:'Configuración'!$B$52,A8,2)","v":"Acido Clorhídrico (en litros)"},0,null,null,null,null,null,null,null,null,{"$f":"Marzo!C8","v":0}]
[5,{"$f":"INDEX(Configuración!$A$3:'Configuración'!$B$52,A9,2)","v":"Acido Fórmico, sales y sus derivados (en litros)"},0,null,null,null,null,null,null,null,null,{"$f":"Marzo!C9","v":0}]
[6,{"$f":"INDEX(Configuración!$A$3:'Configuración'!$B$52,A10,2)","v":"Acido Sulfúrico (en litros)"},0,null,null,null,null,null,null,null,null,{"$f":"Marzo!C10","v":0}]
{"$rows_left_out":45}
{"sheet":"Mayo","index":4,"n_rows":54,"n_cols":12,"rows_kept":54,"cut":false,"hidden":false,"merged":[]}
[null,"INFORME RENPRE MES","MAYO",{"$f":"Configuración!E2","v":2018},"SECCION",{"$f":"Configuración!G2","v":"TOXICO"}]
[]
[null,null,"STOCK","INGRESO 1","INGRESO 1","INGRESO 1","INGRESO 2","INGRESO 2","INGRESO 2","MERMA",null,"STOCK"]
["N°","SUSTANCIA CONTROLADA","ACTUAL","FECHA","CANTIDAD","REMITO","FECHA","CANTIDAD","REMITO","MENSUAL","OBSERVACIONES","ANTERIOR"]
[1,{"$f":"INDEX(Configuración!$A$3:'Configuración'!$B$52,A5,2)","v":"Acetato Etílico (en litros)"},{"$f":"$L5+$E5+$H5-$J5","v":0},null,null,null,null,null,null,null,null,{"$f":"Abril!C5","v":0}]
[2,{"$f":"INDEX(Configuración!$A$3:'Configuración'!$B$52,A6,2)","v":"Acetona (en litros)"},{"$f":"$L6+$E6+$H6-$J6","v":0},null,null,null,null,null,null,null,null,{"$f":"Abril!C6","v":0}]
[3,{"$f":"INDEX(Configuración!$A$3:'Configuración'!$B$52,A7,2)","v":"Acido Acético (en litros)"},0,null,null,null,null,null,null,null,null,{"$f":"Abril!C7","v":0}]
[4,{"$f":"INDEX(Configuración!$A$3:'Configuración'!$B$52,A8,2)","v":"Acido Clorhídrico (en litros)"},0,null,null,null,null,null,null,null,null,{"$f":"Abril!C8","v":0}]
[5,{"$f":"INDEX(Configuración!$A$3:'Configuración'!$B$52,A9,2)","v":"Acido Fórmico, sales y sus derivados (en litros)"},0,null,null,null,null,null,null,null,null,{"$f":"Abril!C9","v":0}]
[6,{"$f":"INDEX(Configuración!$A$3:'Configuración'!$B$52,A10,2)","v":"Acido Sulfúrico (en litros)"},0,null,null,null,null,null,null,null,null,{"$f":"Abril!C10","v":0}]
{"$rows_left_out":45}
{"sheet":"Junio","index":5,"n_rows":54,"n_cols":12,"rows_kept":54,"cut":false,"hidden":false,"merged":[]}
[null,"INFORME RENPRE MES","JUNIO",{"$f":"Configuración!E2","v":2018},"SECCION",{"$f":"Configuración!G2","v":"TOXICO"}]
[]
[null,null,"STOCK","INGRESO 1","INGRESO 1","INGRESO 1","INGRESO 2","INGRESO 2","INGRESO 2","MERMA",null,"STOCK"]
["N°","SUSTANCIA CONTROLADA","ACTUAL","FECHA","CANTIDAD","REMITO","FECHA","CANTIDAD","REMITO","MENSUAL","OBSERVACIONES","ANTERIOR"]
[1,{"$f":"INDEX(Configuración!$A$3:'Configuración'!$B$52,A5,2)","v":"Acetato Etílico (en litros)"},{"$f":"$L5+$E5+$H5-$J5","v":0},null,null,null,null,null,null,null,null,{"$f":"Mayo!C5","v":0}]
[2,{"$f":"INDEX(Configuración!$A$3:'Configuración'!$B$52,A6,2)","v":"Acetona (en litros)"},{"$f":"$L6+$E6+$H6-$J6","v":0},null,null,null,null,null,null,null,null,{"$f":"Mayo!C6","v":0}]
[3,{"$f":"INDEX(Configuración!$A$3:'Configuración'!$B$52,A7,2)","v":"Acido Acético (en litros)"},0,null,null,null,null,null,null,null,null,{"$f":"Mayo!C7","v":0}]
[4,{"$f":"INDEX(Configuración!$A$3:'Configuración'!$B$52,A8,2)","v":"Acido Clorhídrico (en litros)"},0,null,null,null,null,null,null,null,null,{"$f":"Mayo!C8","v":0}]
[5,{"$f":"INDEX(Configuración!$A$3:'Configuración'!$B$52,A9,2)","v":"Acido Fórmico, sales y sus derivados (en litros)"},0,null,null,null,null,null,null,null,null,{"$f":"Mayo!C9","v":0}]
[6,{"$f":"INDEX(Configuración!$A$3:'Configuración'!$B$52,A10,2)","v":"Acido Sulfúrico (en litros)"},0,null,null,null,null,null,null,null,null,{"$f":"Mayo!C10","v":0}]
{"$rows_left_out":45}
{"sheet":"Julio","index":6,"n_rows":54,"n_cols":12,"rows_kept":54,"cut":false,"hidden":false,"merged":[]}
[null,"INFORME RENPRE MES","JULIO",{"$f":"Configuración!E2","v":2018},"SECCION",{"$f":"Configuración!G2","v":"TOXICO"}]
[]
[null,null,"STOCK","INGRESO 1","INGRESO 1","INGRESO 1","INGRESO 2","INGRESO 2","INGRESO 2","MERMA",null,"STOCK"]
["N°","SUSTANCIA CONTROLADA","ACTUAL","FECHA","CANTIDAD","REMITO","FECHA","CANTIDAD","REMITO","MENSUAL","OBSERVACIONES","ANTERIOR"]
[1,{"$f":"INDEX(Configuración!$A$3:'Configuración'!$B$52,A5,2)","v":"Acetato Etílico (en litros)"},{"$f":"$L5+$E5+$H5-$J5","v":0},null,null,null,null,null,null,null,null,{"$f":"Junio!C5","v":0}]
[2,{"$f":"INDEX(Configuración!$A$3:'Configuración'!$B$52,A6,2)","v":"Acetona (en litros)"},{"$f":"$L6+$E6+$H6-$J6","v":0},null,null,null,null,null,null,null,null,{"$f":"Junio!C6","v":0}]
[3,{"$f":"INDEX(Configuración!$A$3:'Configuración'!$B$52,A7,2)","v":"Acido Acético (en litros)"},0,null,null,null,null,null,null,null,null,{"$f":"Junio!C7","v":0}]
[4,{"$f":"INDEX(Configuración!$A$3:'Configuración'!$B$52,A8,2)","v":"Acido Clorhídrico (en litros)"},0,null,null,null,null,null,null,null,null,{"$f":"Junio!C8","v":0}]
[5,{"$f":"INDEX(Configuración!$A$3:'Configuración'!$B$52,A9,2)","v":"Acido Fórmico, sales y sus derivados (en litros)"},0,null,null,null,null,null,null,null,null,{"$f":"Junio!C9","v":0}]
[6,{"$f":"INDEX(Configuración!$A$3:'Configuración'!$B$52,A10,2)","v":"Acido Sulfúrico (en litros)"},0,null,null,null,null,null,null,null,null,{"$f":"Junio!C10","v":0}]
{"$rows_left_out":45}
{"sheet":"Agosto","index":7,"n_rows":54,"n_cols":12,"rows_kept":54,"cut":false,"hidden":false,"merged":[]}
[null,"INFORME RENPRE MES","AGOSTO",{"$f":"Configuración!E2","v":2018},"SECCION",{"$f":"Configuración!G2","v":"TOXICO"}]
[]
[null,null,"STOCK","INGRESO 1","INGRESO 1","INGRESO 1","INGRESO 2","INGRESO 2","INGRESO 2","MERMA",null,"STOCK"]
["N°","SUSTANCIA CONTROLADA","ACTUAL","FECHA","CANTIDAD","REMITO","FECHA","CANTIDAD","REMITO","MENSUAL","OBSERVACIONES","ANTERIOR"]
[1,{"$f":"INDEX(Configuración!$A$3:'Configuración'!$B$52,A5,2)","v":"Acetato Etílico (en litros)"},{"$f":"$L5+$E5+$H5-$J5","v":0},null,null,null,null,null,null,null,null,{"$f":"Julio!C5","v":0}]
[2,{"$f":"INDEX(Configuración!$A$3:'Configuración'!$B$52,A6,2)","v":"Acetona (en litros)"},{"$f":"$L6+$E6+$H6-$J6","v":0},null,null,null,null,null,null,null,null,{"$f":"Julio!C6","v":0}]
[3,{"$f":"INDEX(Configuración!$A$3:'Configuración'!$B$52,A7,2)","v":"Acido Acético (en litros)"},0,null,null,null,null,null,null,null,null,{"$f":"Julio!C7","v":0}]
[4,{"$f":"INDEX(Configuración!$A$3:'Configuración'!$B$52,A8,2)","v":"Acido Clorhídrico (en litros)"},0,null,null,null,null,null,null,null,null,{"$f":"Julio!C8","v":0}]
[5,{"$f":"INDEX(Configuración!$A$3:'Configuración'!$B$52,A9,2)","v":"Acido Fórmico, sales y sus derivados (en litros)"},0,null,null,null,null,null,null,null,null,{"$f":"Julio!C9","v":0}]
[6,{"$f":"INDEX(Configuración!$A$3:'Configuración'!$B$52,A10,2)","v":"Acido Sulfúrico (en litros)"},0,null,null,null,null,null,null,null,null,{"$f":"Julio!C10","v":0}]
{"$rows_left_out":45}
{"sheet":"Setiembre","index":8,"n_rows":54,"n_cols":12,"rows_kept":54,"cut":false,"hidden":false,"merged":[]}
[null,"INFORME RENPRE MES","SETIEMBRE",{"$f":"Configuración!E2","v":2018},"SECCION",{"$f":"Configuración!G2","v":"TOXICO"}]
[]
[null,null,"STOCK","INGRESO 1","INGRESO 1","INGRESO 1","INGRESO 2","INGRESO 2","INGRESO 2","MERMA",null,"STOCK"]
["N°","SUSTANCIA CONTROLADA","ACTUAL","FECHA","CANTIDAD","REMITO","FECHA","CANTIDAD","REMITO","MENSUAL","OBSERVACIONES","ANTERIOR"]
[1,{"$f":"INDEX(Configuración!$A$3:'Configuración'!$B$52,A5,2)","v":"Acetato Etílico (en litros)"},{"$f":"$L5+$E5+$H5-$J5","v":0},null,null,null,null,null,null,null,null,{"$f":"Agosto!C5","v":0}]
[2,{"$f":"INDEX(Configuración!$A$3:'Configuración'!$B$52,A6,2)","v":"Acetona (en litros)"},{"$f":"$L6+$E6+$H6-$J6","v":0},null,null,null,null,null,null,null,null,{"$f":"Agosto!C6","v":0}]
[3,{"$f":"INDEX(Configuración!$A$3:'Configuración'!$B$52,A7,2)","v":"Acido Acético (en litros)"},0,null,null,null,null,null,null,null,null,{"$f":"Agosto!C7","v":0}]
[4,{"$f":"INDEX(Configuración!$A$3:'Configuración'!$B$52,A8,2)","v":"Acido Clorhídrico (en litros)"},0,null,null,null,null,null,null,null,null,{"$f":"Agosto!C8","v":0}]
[5,{"$f":"INDEX(Configuración!$A$3:'Configuración'!$B$52,A9,2)","v":"Acido Fórmico, sales y sus derivados (en litros)"},0,null,null,null,null,null,null,null,null,{"$f":"Agosto!C9","v":0}]
[6,{"$f":"INDEX(Configuración!$A$3:'Configuración'!$B$52,A10,2)","v":"Acido Sulfúrico (en litros)"},0,null,null,null,null,null,null,null,null,{"$f":"Agosto!C10","v":0}]
{"$rows_left_out":45}
{"sheet":"Octubre","index":9,"n_rows":54,"n_cols":12,"rows_kept":54,"cut":false,"hidden":false,"merged":[]}
[null,"INFORME RENPRE MES","OCTUBRE",{"$f":"Configuración!E2","v":2018},"SECCION",{"$f":"Configuración!G2","v":"TOXICO"}]
[]
[null,null,"STOCK","INGRESO 1","INGRESO 1","INGRESO 1","INGRESO 2","INGRESO 2","INGRESO 2","MERMA",null,"STOCK"]
["N°","SUSTANCIA CONTROLADA","ACTUAL","FECHA","CANTIDAD","REMITO","FECHA","CANTIDAD","REMITO","MENSUAL","OBSERVACIONES","ANTERIOR"]
[1,{"$f":"INDEX(Configuración!$A$3:'Configuración'!$B$52,A5,2)","v":"Acetato Etílico (en litros)"},{"$f":"$L5+$E5+$H5-$J5","v":0},null,null,null,null,null,null,null,null,{"$f":"Setiembre!C5","v":0}]
[2,{"$f":"INDEX(Configuración!$A$3:'Configuración'!$B$52,A6,2)","v":"Acetona (en litros)"},{"$f":"$L6+$E6+$H6-$J6","v":0},null,null,null,null,null,null,null,null,{"$f":"Setiembre!C6","v":0}]
[3,{"$f":"INDEX(Configuración!$A$3:'Configuración'!$B$52,A7,2)","v":"Acido Acético (en litros)"},0,null,null,null,null,null,null,null,null,{"$f":"Setiembre!C7","v":0}]
[4,{"$f":"INDEX(Configuración!$A$3:'Configuración'!$B$52,A8,2)","v":"Acido Clorhídrico (en litros)"},0,null,null,null,null,null,null,null,null,{"$f":"Setiembre!C8","v":0}]
[5,{"$f":"INDEX(Configuración!$A$3:'Configuración'!$B$52,A9,2)","v":"Acido Fórmico, sales y sus derivados (en litros)"},0,null,null,null,null,null,null,null,null,{"$f":"Setiembre!C9","v":0}]
[6,{"$f":"INDEX(Configuración!$A$3:'Configuración'!$B$52,A10,2)","v":"Acido Sulfúrico (en litros)"},0,null,null,null,null,null,null,null,null,{"$f":"Setiembre!C10","v":0}]
{"$rows_left_out":45}
{"sheet":"Noviembre","index":10,"n_rows":54,"n_cols":12,"rows_kept":54,"cut":false,"hidden":false,"merged":[]}
[null,"INFORME RENPRE MES","NOVIEMBRE",{"$f":"Configuración!E2","v":2018},"SECCION",{"$f":"Configuración!G2","v":"TOXICO"}]
[]
[null,null,"STOCK","INGRESO 1","INGRESO 1","INGRESO 1","INGRESO 2","INGRESO 2","INGRESO 2","MERMA",null,"STOCK"]
["N°","SUSTANCIA CONTROLADA","ACTUAL","FECHA","CANTIDAD","REMITO","FECHA","CANTIDAD","REMITO","MENSUAL","OBSERVACIONES","ANTERIOR"]
[1,{"$f":"INDEX(Configuración!$A$3:'Configuración'!$B$52,A5,2)","v":"Acetato Etílico (en litros)"},{"$f":"$L5+$E5+$H5-$J5","v":0},null,null,null,null,null,null,null,null,{"$f":"Octubre!C5","v":0}]
[2,{"$f":"INDEX(Configuración!$A$3:'Configuración'!$B$52,A6,2)","v":"Acetona (en litros)"},{"$f":"$L6+$E6+$H6-$J6","v":0},null,null,null,null,null,null,null,null,{"$f":"Octubre!C6","v":0}]
[3,{"$f":"INDEX(Configuración!$A$3:'Configuración'!$B$52,A7,2)","v":"Acido Acético (en litros)"},0,null,null,null,null,null,null,null,null,{"$f":"Octubre!C7","v":0}]
[4,{"$f":"INDEX(Configuración!$A$3:'Configuración'!$B$52,A8,2)","v":"Acido Clorhídrico (en litros)"},0,null,null,null,null,null,null,null,null,{"$f":"Octubre!C8","v":0}]
[5,{"$f":"INDEX(Configuración!$A$3:'Configuración'!$B$52,A9,2)","v":"Acido Fórmico, sales y sus derivados (en litros)"},0,null,null,null,null,null,null,null,null,{"$f":"Octubre!C9","v":0}]
[6,{"$f":"INDEX(Configuración!$A$3:'Configuración'!$B$52,A10,2)","v":"Acido Sulfúrico (en litros)"},0,null,null,null,null,null,null,null,null,{"$f":"Octubre!C10","v":0}]
{"$rows_left_out":45}
{"sheet":"Diciembre","index":11,"n_rows":54,"n_cols":12,"rows_kept":54,"cut":false,"hidden":false,"merged":[]}
[null,"INFORME RENPRE MES","DICIEMBRE",{"$f":"Configuración!E2","v":2018},"SECCION",{"$f":"Configuración!G2","v":"TOXICO"}]
[]
[null,null,"STOCK","INGRESO 1","INGRESO 1","INGRESO 1","INGRESO 2","INGRESO 2","INGRESO 2","MERMA",null,"STOCK"]
["N°","SUSTANCIA CONTROLADA","ACTUAL","FECHA","CANTIDAD","REMITO","FECHA","CANTIDAD","REMITO","MENSUAL","OBSERVACIONES","ANTERIOR"]
[1,{"$f":"INDEX(Configuración!$A$3:'Configuración'!$B$52,A5,2)","v":"Acetato Etílico (en litros)"},{"$f":"$L5+$E5+$H5-$J5","v":0},null,null,null,null,null,null,null,null,{"$f":"Noviembre!C5","v":0}]
[2,{"$f":"INDEX(Configuración!$A$3:'Configuración'!$B$52,A6,2)","v":"Acetona (en litros)"},{"$f":"$L6+$E6+$H6-$J6","v":0},null,null,null,null,null,null,null,null,{"$f":"Noviembre!C6","v":0}]
[3,{"$f":"INDEX(Configuración!$A$3:'Configuración'!$B$52,A7,2)","v":"Acido Acético (en litros)"},0,null,null,null,null,null,null,null,null,{"$f":"Noviembre!C7","v":0}]
[4,{"$f":"INDEX(Configuración!$A$3:'Configuración'!$B$52,A8,2)","v":"Acido Clorhídrico (en litros)"},0,null,null,null,null,null,null,null,null,{"$f":"Noviembre!C8","v":0}]
[5,{"$f":"INDEX(Configuración!$A$3:'Configuración'!$B$52,A9,2)","v":"Acido Fórmico, sales y sus derivados (en litros)"},0,null,null,null,null,null,null,null,null,{"$f":"Noviembre!C9","v":0}]
[6,{"$f":"INDEX(Configuración!$A$3:'Configuración'!$B$52,A10,2)","v":"Acido Sulfúrico (en litros)"},0,null,null,null,null,null,null,null,null,{"$f":"Noviembre!C10","v":0}]
{"$rows_left_out":45}
{"sheet":"Informe","index":12,"n_rows":0,"n_cols":0,"rows_kept":0,"cut":false,"hidden":false,"merged":[]}

{"sheet":"Configuración","index":13,"n_rows":52,"n_cols":7,"rows_kept":52,"cut":false,"hidden":false,"merged":[]}
[null,null,"STOCK",null,"AÑO",null,"LABORATORIO"]
[null,"SUSTANCIA CONTROLADA","AÑO ANTERIOR",null,2018,null,"TOXICO"]
[1,"Acetato Etílico (en litros)"]
[2,"Acetona (en litros)",null,null,"CONTRASEÑA",null,"TOXICO"]
[3,"Acido Acético (en litros)",null,null,"PERICIAL",null,"AP"]
[4,"Acido Clorhídrico (en litros)",null,null,null,null,"ADN"]
[5,"Acido Fórmico, sales y sus derivados (en litros)"]
[6,"Acido Sulfúrico (en litros)"]
[7,"Alcohol Etílico (en litros)"]
[8,"Alcohol Isobutílico (en litros)"]
{"$rows_left_out":42}